Target
Cholinesterase
Ligand
BDBM50053426
Substrate
Meas. Tech.
ChEMBL_1460148 (CHEMBL3369133)
IC50
955±n/a nM
Citation
 Darras, FHWehle, SHuang, GSotriffer, CADecker, M Amine substitution of quinazolinones leads to selective nanomolar AChE inhibitors with 'inverted' binding mode. Bioorg Med Chem 22:4867-81 (2014)  
Target
Name:
Cholinesterase
Synonyms:
BCHE CHLE_HORSE | Cholinesterase
Type:
Enzyme
Mol. Mass.:
65643.35
Organism:
Equus caballus (Horse)
Description:
P81908
Residue:
574
  
Inhibitor
Name:
BDBM50053426
Synonyms:
CHEMBL3323042
Type:
Small organic molecule
Emp. Form.:
C24H27N3O2
Mol. Mass.:
389.4901
SMILES:
O=c1n2CCc3ccccc3-c2nc2ccc(OCCCN3CCCCC3)cc12
: