Target
Renin
Ligand
BDBM50054636
Substrate
Meas. Tech.
ChEMBL_1452194 (CHEMBL3365816)
IC50
0.400000±n/a nM
Citation
 Ehara, TIrie, OKosaka, TKanazawa, TBreitenstein, WGrosche, POstermann, NSuzuki, MKawakami, SKonishi, KHitomi, YToyao, AGunji, HCumin, FSchiering, NWagner, TRigel, DFWebb, RLMaibaum, JYokokawa, F Structure-based design of substituted piperidines as a new class of highly efficacious oral direct Renin inhibitors. ACS Med Chem Lett 5:787-92 (2014)  
Target
Name:
Renin
Synonyms:
Angiotensinogenase RENI_HUMAN
Type:
Enzyme
Mol. Mass.:
45058.99
Organism:
Homo sapiens (Human)
Description:
Residue:
406
  
Inhibitor
Name:
BDBM50054636
Synonyms:
CHEMBL3318937
Type:
Small organic molecule
Emp. Form.:
C32H42N4O4
Mol. Mass.:
546.7003
SMILES:
COCCCn1cc(CN(C2CC2)C(=O)[C@H]2CNC[C@H](C2)C(=O)N[C@H](CCO)c2ccccc2)c2ccccc12
: