Target
Renin
Ligand
BDBM50054540
Substrate
Meas. Tech.
ChEMBL_1452194 (CHEMBL3365816)
IC50
0.300000±n/a nM
Citation
 Ehara, TIrie, OKosaka, TKanazawa, TBreitenstein, WGrosche, POstermann, NSuzuki, MKawakami, SKonishi, KHitomi, YToyao, AGunji, HCumin, FSchiering, NWagner, TRigel, DFWebb, RLMaibaum, JYokokawa, F Structure-based design of substituted piperidines as a new class of highly efficacious oral direct Renin inhibitors. ACS Med Chem Lett 5:787-92 (2014)  
Target
Name:
Renin
Synonyms:
Angiotensinogenase RENI_HUMAN
Type:
Enzyme
Mol. Mass.:
45058.99
Organism:
Homo sapiens (Human)
Description:
Residue:
406
  
Inhibitor
Name:
BDBM50054540
Synonyms:
CHEMBL3318939
Type:
Small organic molecule
Emp. Form.:
C31H51ClFN3O5
Mol. Mass.:
600.205
SMILES:
Cl.CCOC[C@@H](CC(C)C)NC(=O)[C@@H]1CNC[C@@H](C1)C(=O)N(C1CC1)c1cc(OCCCOC)c(cc1F)C(C)C
: