Target
Renin
Ligand
BDBM50054633
Substrate
Meas. Tech.
ChEMBL_1452194 (CHEMBL3365816)
IC50
0.400000±n/a nM
Citation
 Ehara, TIrie, OKosaka, TKanazawa, TBreitenstein, WGrosche, POstermann, NSuzuki, MKawakami, SKonishi, KHitomi, YToyao, AGunji, HCumin, FSchiering, NWagner, TRigel, DFWebb, RLMaibaum, JYokokawa, F Structure-based design of substituted piperidines as a new class of highly efficacious oral direct Renin inhibitors. ACS Med Chem Lett 5:787-92 (2014)  
Target
Name:
Renin
Synonyms:
Angiotensinogenase RENI_HUMAN
Type:
Enzyme
Mol. Mass.:
45058.99
Organism:
Homo sapiens (Human)
Description:
Residue:
406
  
Inhibitor
Name:
BDBM50054633
Synonyms:
CHEMBL3318941
Type:
Small organic molecule
Emp. Form.:
C30H51ClN4O5
Mol. Mass.:
583.203
SMILES:
Cl.CCOC[C@@H](CC(C)C)NC(=O)[C@@H]1CNC[C@@H](C1)C(=O)N(C1CC1)c1cc(OCCCOC)c(cn1)C(C)C
: