Target
Adenosine receptor A2b
Ligand
BDBM50055099
Substrate
Meas. Tech.
ChEMBL_1447963 (CHEMBL3379789)
IC50
314±n/a nM
Citation
 Squarcialupi, LColotta, VCatarzi, DVarano, FBetti, MVarani, KVincenzi, FBorea, PAPorta, NCiancetta, AMoro, S 7-Amino-2-phenylpyrazolo[4,3-d]pyrimidine derivatives: structural investigations at the 5-position to target human A1 and A(2A) adenosine receptors. Molecular modeling and pharmacological studies. Eur J Med Chem 84:614-27 (2014)  
Target
Name:
Adenosine receptor A2b
Synonyms:
AA2BR_HUMAN ADORA2B Adenosine receptors A2b | Adenosine receptors; A2a & A2b
Type:
G Protein-Coupled Receptor (GPCR)
Mol. Mass.:
36341.22
Organism:
Homo sapiens (Human)
Description:
Residue:
332
  
Inhibitor
Name:
BDBM50055099
Synonyms:
CHEMBL3317579
Type:
Small organic molecule
Emp. Form.:
C20H19N5O
Mol. Mass.:
345.3978
SMILES:
Nc1nc(CCCc2cccc(O)c2)nc2cn(nc12)-c1ccccc1
: