Target
Sodium-dependent dopamine transporter
Ligand
BDBM50362868
Substrate
Meas. Tech.
ChEMBL_1452254 (CHEMBL3366166)
Ki
>10000±n/a nM
Citation
 Sampson, DBricker, BZhu, XYPeprah, KLamango, NSSetola, VRoth, BLAblordeppey, SY Further evaluation of the tropane analogs of haloperidol. Bioorg Med Chem Lett 24:4294-7 (2014)  
Target
Name:
Sodium-dependent dopamine transporter
Synonyms:
DA transporter DAT1 Dopamine transporter protein (DAT) SC6A3_HUMAN Sodium-dependent dopamine transporter Solute carrier family 6 member 3
Type:
Multi-pass membrane protein
Mol. Mass.:
68497.11
Organism:
Homo sapiens (Human)
Description:
Q01959
Residue:
620
  
Inhibitor
Name:
BDBM50362868
Synonyms:
CHEMBL1940404
Type:
Small organic molecule
Emp. Form.:
C20H23ClFNO2
Mol. Mass.:
363.854
SMILES:
OC1(CCN(CCCOc2ccc(F)cc2)CC1)c1ccc(Cl)cc1
: