Target
5-hydroxytryptamine receptor 1A
Ligand
BDBM50055523
Substrate
Meas. Tech.
ChEMBL_1452240 (CHEMBL3366152)
Ki
8.2±n/a nM
Citation
 Sampson, DBricker, BZhu, XYPeprah, KLamango, NSSetola, VRoth, BLAblordeppey, SY Further evaluation of the tropane analogs of haloperidol. Bioorg Med Chem Lett 24:4294-7 (2014)  
Target
Name:
5-hydroxytryptamine receptor 1A
Synonyms:
5-HT-1A 5-hydroxytryptamine receptor 1A (5-HT-1A) ADRB2RL1 Dopamine D2 receptor and serotonin 1a receptor HTR1A | Serotonin receptor 1A
Type:
Mol. Mass.:
46122.49
Organism:
Homo sapiens (Human)
Description:
Residue:
422
  
Inhibitor
Name:
BDBM50055523
Synonyms:
CHEMBL3321792
Type:
Small organic molecule
Emp. Form.:
C22H25ClFNOS
Mol. Mass.:
405.956
SMILES:
OC1(CC2CCC(C1)N2CCCSc1ccccc1F)c1ccc(Cl)cc1
: