Target
Sphingosine 1-phosphate receptor 1
Ligand
BDBM50055538
Substrate
Meas. Tech.
ChEMBL_1452260 (CHEMBL3366172)
EC50
19±n/a nM
Citation
 Tian, YJin, JWang, XHu, JXiao, QZhou, WChen, XYin, D Discovery of oxazole and triazole derivatives as potent and selective S1P(1) agonists through pharmacophore-guided design. Eur J Med Chem 85:1-15 (2014)  
Target
Name:
Sphingosine 1-phosphate receptor 1
Synonyms:
CHEDG1 Endothelial differentiation G-protein coupled receptor 1 S1P1 S1PR1_HUMAN Sphingosine 1-phosphate receptor Edg-1
Type:
Enzyme
Mol. Mass.:
42836.02
Organism:
Homo sapiens (Human)
Description:
P21453
Residue:
382
  
Inhibitor
Name:
BDBM50055538
Synonyms:
CHEMBL3342010
Type:
Small organic molecule
Emp. Form.:
C22H29N4O5P
Mol. Mass.:
460.4632
SMILES:
CCCc1ccc(cc1)-n1cc(nn1)-c1ccc(CCC(N)(CO)COP(O)(O)=O)cc1
: