Target
Renin
Ligand
BDBM50055909
Substrate
Meas. Tech.
ChEMBL_1458604 (CHEMBL3371147)
IC50
8400±n/a nM
Citation
 Grädler, UCzodrowski, PTsaklakidis, CKlein, MWerkmann, DLindemann, SMaskos, KLeuthner, B Structure-based optimization of non-peptidic Cathepsin D inhibitors. Bioorg Med Chem Lett 24:4141-50 (2014)  
Target
Name:
Renin
Synonyms:
Angiotensinogenase RENI_HUMAN
Type:
Enzyme
Mol. Mass.:
45058.99
Organism:
Homo sapiens (Human)
Description:
Residue:
406
  
Inhibitor
Name:
BDBM50055909
Synonyms:
CHEMBL3321924
Type:
Small organic molecule
Emp. Form.:
C30H31N5O6
Mol. Mass.:
557.597
SMILES:
COc1ccc(CC(=O)NC(=N)N[C@@H](Cc2ccccc2)C(=O)NCCN2C(=O)c3ccccc3C2=O)cc1OC
: