Target
Renin
Ligand
BDBM50055913
Substrate
Meas. Tech.
ChEMBL_1458604 (CHEMBL3371147)
IC50
20000±n/a nM
Citation
 Grädler, UCzodrowski, PTsaklakidis, CKlein, MWerkmann, DLindemann, SMaskos, KLeuthner, B Structure-based optimization of non-peptidic Cathepsin D inhibitors. Bioorg Med Chem Lett 24:4141-50 (2014)  
Target
Name:
Renin
Synonyms:
Angiotensinogenase RENI_HUMAN
Type:
Enzyme
Mol. Mass.:
45058.99
Organism:
Homo sapiens (Human)
Description:
Residue:
406
  
Inhibitor
Name:
BDBM50055913
Synonyms:
CHEMBL3321921
Type:
Small organic molecule
Emp. Form.:
C19H23N3O3
Mol. Mass.:
341.4042
SMILES:
COc1ccc(CCC(=O)NC(=N)NCc2ccccc2)cc1OC
: