Target
Cathepsin D
Ligand
BDBM50055927
Substrate
Meas. Tech.
ChEMBL_1458603 (CHEMBL3371146)
IC50
510±n/a nM
Citation
 Grädler, UCzodrowski, PTsaklakidis, CKlein, MWerkmann, DLindemann, SMaskos, KLeuthner, B Structure-based optimization of non-peptidic Cathepsin D inhibitors. Bioorg Med Chem Lett 24:4141-50 (2014)  
Target
Name:
Cathepsin D
Synonyms:
CATD_HUMAN CTSD Cathepsin D heavy chain Cathepsin D precursor
Type:
Enzyme
Mol. Mass.:
44551.72
Organism:
Homo sapiens (Human)
Description:
Human proCathepsin D (SwissProt accession number P07339) was expressed in Sf9 cells, purified, and autoactivated.
Residue:
412
  
Inhibitor
Name:
BDBM50055927
Synonyms:
CHEMBL3321937 | US9884814, Compound 273
Type:
Small organic molecule
Emp. Form.:
C25H32N8O4
Mol. Mass.:
508.5728
SMILES:
COc1ccc(CC(=O)NC(=N)N[C@H](CC(C)C)C(=O)NCc2ccc(cc2)-c2nnn[nH]2)cc1OC
: