Target
Cathepsin D
Ligand
BDBM50055909
Substrate
Meas. Tech.
ChEMBL_1458603 (CHEMBL3371146)
IC50
8300±n/a nM
Citation
 Grädler, UCzodrowski, PTsaklakidis, CKlein, MWerkmann, DLindemann, SMaskos, KLeuthner, B Structure-based optimization of non-peptidic Cathepsin D inhibitors. Bioorg Med Chem Lett 24:4141-50 (2014)  
Target
Name:
Cathepsin D
Synonyms:
CATD_HUMAN CTSD Cathepsin D heavy chain Cathepsin D precursor
Type:
Enzyme
Mol. Mass.:
44551.72
Organism:
Homo sapiens (Human)
Description:
Human proCathepsin D (SwissProt accession number P07339) was expressed in Sf9 cells, purified, and autoactivated.
Residue:
412
  
Inhibitor
Name:
BDBM50055909
Synonyms:
CHEMBL3321924
Type:
Small organic molecule
Emp. Form.:
C30H31N5O6
Mol. Mass.:
557.597
SMILES:
COc1ccc(CC(=O)NC(=N)N[C@@H](Cc2ccccc2)C(=O)NCCN2C(=O)c3ccccc3C2=O)cc1OC
: