Target
Cathepsin D
Ligand
BDBM50055915
Substrate
Meas. Tech.
ChEMBL_1458603 (CHEMBL3371146)
IC50
10000±n/a nM
Citation
 Grädler, UCzodrowski, PTsaklakidis, CKlein, MWerkmann, DLindemann, SMaskos, KLeuthner, B Structure-based optimization of non-peptidic Cathepsin D inhibitors. Bioorg Med Chem Lett 24:4141-50 (2014)  
Target
Name:
Cathepsin D
Synonyms:
CATD_HUMAN CTSD Cathepsin D heavy chain Cathepsin D precursor
Type:
Enzyme
Mol. Mass.:
44551.72
Organism:
Homo sapiens (Human)
Description:
Human proCathepsin D (SwissProt accession number P07339) was expressed in Sf9 cells, purified, and autoactivated.
Residue:
412
  
Inhibitor
Name:
BDBM50055915
Synonyms:
CHEMBL3321919
Type:
Small organic molecule
Emp. Form.:
C18H20N4O5
Mol. Mass.:
372.3752
SMILES:
COc1cc(CC(=O)NC(=N)NCc2ccccc2)c(cc1OC)[N+]([O-])=O
: