Target
Cathepsin D
Ligand
BDBM50055916
Substrate
Meas. Tech.
ChEMBL_1458603 (CHEMBL3371146)
IC50
6100±n/a nM
Citation
 Grädler, UCzodrowski, PTsaklakidis, CKlein, MWerkmann, DLindemann, SMaskos, KLeuthner, B Structure-based optimization of non-peptidic Cathepsin D inhibitors. Bioorg Med Chem Lett 24:4141-50 (2014)  
Target
Name:
Cathepsin D
Synonyms:
CATD_HUMAN CTSD Cathepsin D heavy chain Cathepsin D precursor
Type:
Enzyme
Mol. Mass.:
44551.72
Organism:
Homo sapiens (Human)
Description:
Human proCathepsin D (SwissProt accession number P07339) was expressed in Sf9 cells, purified, and autoactivated.
Residue:
412
  
Inhibitor
Name:
BDBM50055916
Synonyms:
CHEMBL3321918
Type:
Small organic molecule
Emp. Form.:
C17H18ClN3O2
Mol. Mass.:
331.797
SMILES:
COc1ccc(Cl)c(CC(=O)NC(=N)NCc2ccccc2)c1
: