Target
Cathepsin D
Ligand
BDBM50080973
Substrate
Meas. Tech.
ChEMBL_1458601 (CHEMBL3371144)
IC50
250±n/a nM
Citation
 Grädler, UCzodrowski, PTsaklakidis, CKlein, MWerkmann, DLindemann, SMaskos, KLeuthner, B Structure-based optimization of non-peptidic Cathepsin D inhibitors. Bioorg Med Chem Lett 24:4141-50 (2014)  
Target
Name:
Cathepsin D
Synonyms:
CATD_HUMAN CTSD Cathepsin D heavy chain Cathepsin D precursor
Type:
Enzyme
Mol. Mass.:
44551.72
Organism:
Homo sapiens (Human)
Description:
Human proCathepsin D (SwissProt accession number P07339) was expressed in Sf9 cells, purified, and autoactivated.
Residue:
412
  
Inhibitor
Name:
BDBM50080973
Synonyms:
3,5-Dichloro-2-(3,5-dichloro-2-hydroxy-benzenesulfonylamino)-N-[4-(6-ethoxy-benzothiazol-2-ylsulfanyl)-phenyl]-benzamide | CHEMBL83114
Type:
Small organic molecule
Emp. Form.:
C28H19Cl4N3O5S3
Mol. Mass.:
715.475
SMILES:
CCOc1ccc2nc(Sc3ccc(NC(=O)c4cc(Cl)cc(Cl)c4NS(=O)(=O)c4cc(Cl)cc(Cl)c4O)cc3)sc2c1
: