Target
Cathepsin D
Ligand
BDBM50080991
Substrate
Meas. Tech.
ChEMBL_1458601 (CHEMBL3371144)
IC50
210±n/a nM
Citation
 Grädler, UCzodrowski, PTsaklakidis, CKlein, MWerkmann, DLindemann, SMaskos, KLeuthner, B Structure-based optimization of non-peptidic Cathepsin D inhibitors. Bioorg Med Chem Lett 24:4141-50 (2014)  
Target
Name:
Cathepsin D
Synonyms:
CATD_HUMAN CTSD Cathepsin D heavy chain Cathepsin D precursor
Type:
Enzyme
Mol. Mass.:
44551.72
Organism:
Homo sapiens (Human)
Description:
Human proCathepsin D (SwissProt accession number P07339) was expressed in Sf9 cells, purified, and autoactivated.
Residue:
412
  
Inhibitor
Name:
BDBM50080991
Synonyms:
5-[1-[4-(4-Benzoyl-3-hydroxy-2-propyl-phenoxymethyl)-phenyl]-meth-(Z)-ylidene]-2-thioxo-thiazolidin-4-one | CHEMBL68595
Type:
Small organic molecule
Emp. Form.:
C27H23NO4S2
Mol. Mass.:
489.606
SMILES:
CCCc1c(O)c(ccc1OCc1ccc(C=C2SC(S)=NC2=O)cc1)C(=O)c1ccccc1
: