Target
Cathepsin D
Ligand
BDBM50055931
Substrate
Meas. Tech.
ChEMBL_1458606 (CHEMBL3371149)
IC50
1800±n/a nM
Citation
 Grädler, UCzodrowski, PTsaklakidis, CKlein, MWerkmann, DLindemann, SMaskos, KLeuthner, B Structure-based optimization of non-peptidic Cathepsin D inhibitors. Bioorg Med Chem Lett 24:4141-50 (2014)  
Target
Name:
Cathepsin D
Synonyms:
CATD_BOVIN | CTSD
Type:
PROTEIN
Mol. Mass.:
42158.92
Organism:
Bos taurus
Description:
ChEMBL_1458606
Residue:
387
  
Inhibitor
Name:
BDBM50055931
Synonyms:
CHEMBL3321933 | US9884814, Compound 272
Type:
Small organic molecule
Emp. Form.:
C28H36N8O4
Mol. Mass.:
548.6366
SMILES:
COc1ccc(CC(=O)NC(=N)N[C@H](CC2CCCCC2)C(=O)NCc2ccc(cc2)-c2nnn[nH]2)cc1OC
: