Target
TGF-beta receptor type-1
Ligand
BDBM50056680
Substrate
Meas. Tech.
ChEMBL_1453216 (CHEMBL3365509)
IC50
30±n/a nM
Citation
 Mohedas, AHWang, YSanvitale, CECanning, PChoi, SXing, XBullock, ANCuny, GDYu, PB Structure-activity relationship of 3,5-diaryl-2-aminopyridine ALK2 inhibitors reveals unaltered binding affinity for fibrodysplasia ossificans progressiva causing mutants. J Med Chem 57:7900-15 (2014)  
Target
Name:
TGF-beta receptor type-1
Synonyms:
ALK-5 Activin A receptor type II-like protein kinase of 53kD SKR4 TGF-beta receptor type I TGFBR1 TGFR1_HUMAN Transforming growth factor-beta receptor type I
Type:
enzyme
Mol. Mass.:
55968.24
Organism:
Homo sapiens (Human)
Description:
P36897
Residue:
503
  
Inhibitor
Name:
BDBM50056680
Synonyms:
CHEMBL3341794
Type:
Small organic molecule
Emp. Form.:
C25H27N5O3
Mol. Mass.:
445.5136
SMILES:
COc1cc(cc(OC)c1OC)-c1cnn2cc(cnc12)-c1ccc(cc1)N1CCNCC1
: