Target
Cytosolic phospholipase A2
Ligand
BDBM50056716
Substrate
Meas. Tech.
ChEMBL_1454057 (CHEMBL3361803)
IC50
15000±n/a nM
Citation
 Tomoo, TNakatsuka, TKatayama, THayashi, YFujieda, YTerakawa, MNagahira, K Design, synthesis, and biological evaluation of 3-(1-Aryl-1H-indol-5-yl)propanoic acids as new indole-based cytosolic phospholipase A2a inhibitors. J Med Chem 57:7244-62 (2014)  
Target
Name:
Cytosolic phospholipase A2
Synonyms:
CPLA2 PA24A_HUMAN PLA2G4A Phospholipase A2 | Phospholipase A2 group IVA
Type:
Protein
Mol. Mass.:
85219.30
Organism:
Homo sapiens (Human)
Description:
P47712
Residue:
749
  
Inhibitor
Name:
BDBM50056716
Synonyms:
CHEMBL3326962
Type:
Small organic molecule
Emp. Form.:
C29H34N2O6
Mol. Mass.:
506.5901
SMILES:
NC(CO)(CO)CO.CC(Oc1ccc2n(cc(CCc3ccccc3)c2c1)-c1ccccc1)C(O)=O
: