Target
Phosphomannomutase 2
Ligand
BDBM46667
Substrate
Meas. Tech.
ChEMBL_1448920 (CHEMBL3375687)
IC50
>20000±n/a nM
Citation
 Bravo, YTeriete, PDhanya, RPDahl, RLee, PSKiffer-Moreira, TGanji, SRSergienko, ESmith, LHFarquharson, CMillán, JLCosford, ND Design, synthesis and evaluation of benzoisothiazolones as selective inhibitors of PHOSPHO1. Bioorg Med Chem Lett 24:4308-11 (2014)  
Target
Name:
Phosphomannomutase 2
Synonyms:
PMM2 | PMM2_HUMAN
Type:
Enzyme Catalytic Domain
Mol. Mass.:
28082.33
Organism:
Homo sapiens (Human)
Description:
gi_4557839
Residue:
246
  
Inhibitor
Name:
BDBM46667
Synonyms:
2-phenyl-1,2-benzothiazol-3-one MLS-0107957.0001 cid_164981
Type:
Small organic molecule
Emp. Form.:
C13H9NOS
Mol. Mass.:
227.282
SMILES:
O=c1n(sc2ccccc12)-c1ccccc1
: