Target
Mannose-6-phosphate isomerase
Ligand
BDBM46060
Substrate
Meas. Tech.
ChEMBL_1448919 (CHEMBL3375686)
IC50
1100±n/a nM
Citation
 Bravo, YTeriete, PDhanya, RPDahl, RLee, PSKiffer-Moreira, TGanji, SRSergienko, ESmith, LHFarquharson, CMillán, JLCosford, ND Design, synthesis and evaluation of benzoisothiazolones as selective inhibitors of PHOSPHO1. Bioorg Med Chem Lett 24:4308-11 (2014)  
Target
Name:
Mannose-6-phosphate isomerase
Synonyms:
MPI MPI_HUMAN PMI1
Type:
PROTEIN
Mol. Mass.:
46651.35
Organism:
Homo sapiens (Human)
Description:
ChEMBL_1448919
Residue:
423
  
Inhibitor
Name:
BDBM46060
Synonyms:
2-(2,5-dimethylphenyl)-6-fluoranyl-1,2-benzothiazol-3-one 727664-91-7 MLS0315771 | cid_1510389
Type:
Small organic molecule
Emp. Form.:
C15H12FNOS
Mol. Mass.:
273.325
SMILES:
Cc1ccc(C)c(c1)-n1sc2cc(F)ccc2c1=O
: