Target
cAMP-specific 3',5'-cyclic phosphodiesterase 4D
Ligand
BDBM50299568
Substrate
Meas. Tech.
ChEMBL_1450581 (CHEMBL3372159)
IC50
3460±n/a nM
Citation
 Brullo, CMassa, MRocca, MRotolo, CGuariento, SRivera, DRicciarelli, RFedele, EFossa, PBruno, O Synthesis, biological evaluation, and molecular modeling of new 3-(cyclopentyloxy)-4-methoxybenzaldehyde O-(2-(2,6-dimethylmorpholino)-2-oxoethyl) Oxime (GEBR-7b) related phosphodiesterase 4D (PDE4D) inhibitors. J Med Chem 57:7061-72 (2014)  
Target
Name:
cAMP-specific 3',5'-cyclic phosphodiesterase 4D
Synonyms:
3',5'-cyclic phosphodiesterase PDE43 PDE4D_HUMAN | Phosphodiesterase 4D
Type:
Protein
Mol. Mass.:
91092.69
Organism:
Homo sapiens (Human)
Description:
Q08499
Residue:
809
  
Inhibitor
Name:
BDBM50299568
Synonyms:
3-(Cyclopentyloxy)-4-methoxybenzaldehyde O-[3-(2,6-Dimethyl-morpholin-4-yl)-2-hydroxypropyl]-oxime | CHEMBL569624
Type:
Small organic molecule
Emp. Form.:
C22H34N2O5
Mol. Mass.:
406.5158
SMILES:
COc1ccc(\C=N\OCC(O)CN2CC(C)OC(C)C2)cc1OC1CCCC1
: