Target
5-hydroxytryptamine receptor 1A
Ligand
BDBM29554
Substrate
Meas. Tech.
ChEMBL_1456829 (CHEMBL3367562)
Ki
454±n/a nM
Citation
 Salerno, LPittalą, VModica, MNSiracusa, MAIntagliata, SCagnotto, ASalmona, MKurczab, RBojarski, AJRomeo, G Structure-activity relationships and molecular modeling studies of novel arylpiperazinylalkyl 2-benzoxazolones and 2-benzothiazolones as 5-HT(7) and 5-HT(1A) receptor ligands. Eur J Med Chem 85:716-26 (2014)  
Target
Name:
5-hydroxytryptamine receptor 1A
Synonyms:
5-HT-1A 5-hydroxytryptamine receptor 1A (5-HT-1A) ADRB2RL1 Dopamine D2 receptor and serotonin 1a receptor HTR1A | Serotonin receptor 1A
Type:
Mol. Mass.:
46122.49
Organism:
Homo sapiens (Human)
Description:
Residue:
422
  
Inhibitor
Name:
BDBM29554
Synonyms:
benzimidazolone scaffold, 15m
Type:
Small organic molecule
Emp. Form.:
C22H27ClN4O
Mol. Mass.:
398.929
SMILES:
Clc1ccc(cc1)N1CCN(CCCCCn2c3ccccc3[nH]c2=O)CC1
: