Target
Cannabinoid receptor 2
Ligand
BDBM50058435
Substrate
Meas. Tech.
ChEMBL_1459580 (CHEMBL3369615)
Ki
1.1±n/a nM
Citation
 Pinna, GCurzu, MMDore, ALazzari, PRuiu, SPau, AMurineddu, GPinna, GA Tricyclic pyrazoles part 7. Discovery of potent and selective dihydrothienocyclopentapyrazole derived CB2 ligands. Eur J Med Chem 85:747-57 (2014)  
Target
Name:
Cannabinoid receptor 2
Synonyms:
CANNABINOID CB2 CB2 Cannabinoid CB2 receptor Cannabinoid receptor 2 mCB2
Type:
Enzyme Catalytic Domain
Mol. Mass.:
38220.43
Organism:
MOUSE
Description:
P47936
Residue:
347
  
Inhibitor
Name:
BDBM50058435
Synonyms:
CHEMBL3331463
Type:
Small organic molecule
Emp. Form.:
C22H22Cl2N4OS
Mol. Mass.:
461.407
SMILES:
Cc1cc-2c(Cc3c(nn(c-23)-c2ccc(Cl)cc2Cl)C(=O)NN2CCCCCC2)s1
: