Target
Cannabinoid receptor 2
Ligand
BDBM50058500
Substrate
Meas. Tech.
ChEMBL_1459580 (CHEMBL3369615)
Ki
4.8±n/a nM
Citation
 Pinna, GCurzu, MMDore, ALazzari, PRuiu, SPau, AMurineddu, GPinna, GA Tricyclic pyrazoles part 7. Discovery of potent and selective dihydrothienocyclopentapyrazole derived CB2 ligands. Eur J Med Chem 85:747-57 (2014)  
Target
Name:
Cannabinoid receptor 2
Synonyms:
CANNABINOID CB2 CB2 Cannabinoid CB2 receptor Cannabinoid receptor 2 mCB2
Type:
Enzyme Catalytic Domain
Mol. Mass.:
38220.43
Organism:
MOUSE
Description:
P47936
Residue:
347
  
Inhibitor
Name:
BDBM50058500
Synonyms:
CHEMBL3331452
Type:
Small organic molecule
Emp. Form.:
C28H35N3OS
Mol. Mass.:
461.662
SMILES:
CC(C)[C@H]1CC[C@H](C)CC1NC(=O)c1nn(Cc2ccc(C)cc2)c-2c1Cc1sc(C)cc-21
: