Target
Inosine-5'-monophosphate dehydrogenase
Ligand
BDBM50432770
Substrate
Meas. Tech.
ChEMBL_1452429 (CHEMBL3362091)
IC50
300±n/a nM
Citation
 Mandapati, KGorla, SKHouse, ALMcKenney, ESZhang, MRao, SNGollapalli, DRMann, BJGoldberg, JBCuny, GDGlomski, IJHedstrom, L Repurposing cryptosporidium inosine 5'-monophosphate dehydrogenase inhibitors as potential antibacterial agents. ACS Med Chem Lett 5:846-50 (2014)  
Target
Name:
Inosine-5'-monophosphate dehydrogenase
Synonyms:
AB164_07585 AB166_11280 AB168_06335 AB170_00090 AB893_00065 ADT20_14595 BF27_2004 | guaB
Type:
PROTEIN
Mol. Mass.:
52375.32
Organism:
Bacillus anthracis
Description:
ChEMBL_109471
Residue:
487
  
Inhibitor
Name:
BDBM50432770
Synonyms:
CHEMBL2348631
Type:
Small organic molecule
Emp. Form.:
C21H17Cl2N3O3
Mol. Mass.:
430.284
SMILES:
C[C@H](Oc1cccc(Cl)c1Cl)C(=O)Nc1cccc(NC(=O)c2ccncc2)c1
: