Target
Focal adhesion kinase 1
Ligand
BDBM50059453
Substrate
Meas. Tech.
ChEMBL_1460630 (CHEMBL3395871)
IC50
>20000±n/a nM
Target
Name:
Focal adhesion kinase 1
Synonyms:
FADK 1 FAK1 FLT4 Focal adhesion kinase (FAK) Focal adhesion kinase 1 (FAK) Focal adhesion kinase-related nonkinase PTK2 Protein-tyrosine kinase 2 p125FAK | pp125FAK
Type:
Tyrosine-protein kinase
Mol. Mass.:
119233.17
Organism:
Homo sapiens (Human)
Description:
Q05397
Residue:
1052
  
Inhibitor
Name:
BDBM50059453
Synonyms:
CHEMBL3393455
Type:
Small organic molecule
Emp. Form.:
C15H13FN4O
Mol. Mass.:
284.2883
SMILES:
Fc1ccccc1C1c2c[nH]nc2NC2=C1C(=O)CNC2
: