Target
Nitric oxide synthase, inducible
Ligand
BDBM50427863
Substrate
Meas. Tech.
ChEMBL_1461629 (CHEMBL3395014)
Ki
6310±n/a nM
Citation
 Holden, JKKang, SHollingsworth, SALi, HLim, NChen, SHuang, HXue, FTang, WSilverman, RBPoulos, TL Structure-based design of bacterial nitric oxide synthase inhibitors. J Med Chem 58:994-1004 (2015)  
Target
Name:
Nitric oxide synthase, inducible
Synonyms:
Inducible NO synthase Inducible nitric oxide synthase (iNOS) MAC-NOS NOS type II Nitric Oxide Synthase, inducible Nos2
Type:
Enzyme
Mol. Mass.:
130595.79
Organism:
Mus musculus (mouse)
Description:
Recombinant enzyme overexpressed in E. coli.
Residue:
1144
  
Inhibitor
Name:
BDBM50427863
Synonyms:
CHEMBL2326360
Type:
Small organic molecule
Emp. Form.:
C23H29N5
Mol. Mass.:
375.5099
SMILES:
Cc1cc(N)nc(CCc2cc(CN)cc(CCc3cc(C)cc(N)n3)c2)c1
: