Target
Nitric oxide synthase, inducible
Ligand
BDBM50341678
Substrate
Meas. Tech.
ChEMBL_1461629 (CHEMBL3395014)
Ki
3400±n/a nM
Citation
 Holden, JKKang, SHollingsworth, SALi, HLim, NChen, SHuang, HXue, FTang, WSilverman, RBPoulos, TL Structure-based design of bacterial nitric oxide synthase inhibitors. J Med Chem 58:994-1004 (2015)  
Target
Name:
Nitric oxide synthase, inducible
Synonyms:
Inducible NO synthase Inducible nitric oxide synthase (iNOS) MAC-NOS NOS type II Nitric Oxide Synthase, inducible Nos2
Type:
Enzyme
Mol. Mass.:
130595.79
Organism:
Mus musculus (mouse)
Description:
Recombinant enzyme overexpressed in E. coli.
Residue:
1144
  
Inhibitor
Name:
BDBM50341678
Synonyms:
6,6'-(2,2'-(5-Amino-1,3-phenylene)bis(ethane-2,1diyl))-bis(4-methylpyridin-2-amine) CHEMBL1615292 | NOS Inhibitor, 3n
Type:
Small organic molecule
Emp. Form.:
C22H27N5
Mol. Mass.:
361.4833
SMILES:
Cc1cc(N)nc(CCc2cc(N)cc(CCc3cc(C)cc(N)n3)c2)c1
: