Target
Carbonic anhydrase 2
Ligand
BDBM10860
Substrate
Meas. Tech.
ChEMBL_1461813 (CHEMBL3395807)
Ki
170±n/a nM
Citation
 Vullo, DDel Prete, SFisher, GMAndrews, KTPoulsen, SACapasso, CSupuran, CT Sulfonamide inhibition studies of theż-class carbonic anhydrase from the malaria pathogen Plasmodium falciparum. Bioorg Med Chem 23:526-31 (2015)  
Target
Name:
Carbonic anhydrase 2
Synonyms:
CA-II CAC Carbonate dehydratase II Carbonic anhydrase 2 (CA-II) Carbonic anhydrase C Carbonic anhydrase II (CA-II) Carbonic anhydrase II (hCA II) | Carbonic anhydrase isoenzyme II (hCA II)
Type:
Enzyme
Mol. Mass.:
29250.71
Organism:
Homo sapiens (Human)
Description:
P00918
Residue:
260
  
Inhibitor
Name:
BDBM10860
Synonyms:
4-(aminomethyl)benzene-1-sulfonamide MAFENIDE aromatic/heteroaromatic sulfonamide 5 | hCA inhibitor, 9
Type:
Small organic molecule
Emp. Form.:
C7H10N2O2S
Mol. Mass.:
186.232
SMILES:
NCc1ccc(cc1)S(N)(=O)=O
: