Target
Beta-secretase 1
Ligand
BDBM50061874
Substrate
Meas. Tech.
ChEMBL_1462007 (CHEMBL3396457)
IC50
0.700000±n/a nM
Citation
 Cheng, YBrown, JJudd, TCLopez, PQian, WPowers, TSChen, JJBartberger, MDChen, KDunn, RTEpstein, OFremeau, RTHarried, SHickman, DHitchcock, SALuo, YMinatti, AEPatel, VFVargas, HMWahl, RCWeiss, MMWen, PHWhite, RDWhittington, DAZheng, XMWood, S An Orally Available BACE1 Inhibitor That Affords Robust CNS Aß Reduction without Cardiovascular Liabilities. ACS Med Chem Lett 6:210-5 (2015)  
Target
Name:
Beta-secretase 1
Synonyms:
ASP2 Aspartyl protease 2 BACE1 Beta-secretase (BACE) Beta-secretase 1 (BACE 1) Beta-secretase 1 (BACE1) Beta-site amyloid precursor protein cleaving enzyme 1 Memapsin-2 beta-Secretase (BACE-1) | beta-Secretase (BACE1)
Type:
Protein
Mol. Mass.:
55755.10
Organism:
Homo sapiens (Human)
Description:
P56817
Residue:
501
  
Inhibitor
Name:
BDBM50061874
Synonyms:
CHEMBL3394210
Type:
Small organic molecule
Emp. Form.:
C25H16F2N4O2
Mol. Mass.:
442.4169
SMILES:
NC1=N[C@@]2(CO1)c1cc(ccc1Oc1c(F)nc(cc21)-c1ccccc1)-c1cccnc1F
: