Target
Presenilin-1
Ligand
BDBM50062725
Substrate
Meas. Tech.
ChEMBL_1462965 (CHEMBL3398675)
IC50
20200±n/a nM
Citation
 Flesch, DNess, JLamers, CDehm, FPopella, SSteri, ROgorek, IHieke, MDannhardt, GWerz, OWeggen, SSchubert-Zsilavecz, M SAR-studies of¿-secretase modulators with PPAR¿-agonistic and 5-lipoxygenase-inhibitory activity for Alzheimer's disease. Bioorg Med Chem Lett 25:841-6 (2015)  
Target
Name:
Presenilin-1
Synonyms:
3.4.23.- Gamma-Secretase Subunit Presenilin-1 PS1 PSEN1 PSNL1 Presenilin-1 CTF12 Protein S182
Type:
Mol. Mass.:
52657.13
Organism:
Homo sapiens (Human)
Description:
P49768
Residue:
467
  
Inhibitor
Name:
BDBM50062725
Synonyms:
CHEMBL3397722
Type:
Small organic molecule
Emp. Form.:
C32H30F3NO4S
Mol. Mass.:
581.645
SMILES:
CCCC\C(=C/c1cc(OCc2ccc(cc2)-c2csc(C)n2)ccc1OCc1ccc(cc1)C(F)(F)F)C(O)=O
: