Target
Amine oxidase [flavin-containing] B
Ligand
BDBM50063516
Substrate
Meas. Tech.
ChEMBL_1463344 (CHEMBL3399617)
IC50
11900±n/a nM
Citation
 Chirkova, ZVKabanova, MVFilimonov, SIAbramov, IGPetzer, APetzer, JPFirgang, SISuponitsky, KY Inhibition of monoamine oxidase by indole-5,6-dicarbonitrile derivatives. Bioorg Med Chem Lett 25:1206-11 (2015)  
Target
Name:
Amine oxidase [flavin-containing] B
Synonyms:
AOFB_HUMAN MAOB Monoamine oxidase type B (MAO B) Monoamine oxidase type B (MAOB)
Type:
Protein
Mol. Mass.:
58768.76
Organism:
Homo sapiens (Human)
Description:
P27338
Residue:
520
  
Inhibitor
Name:
BDBM50063516
Synonyms:
CHEMBL3398525
Type:
Small organic molecule
Emp. Form.:
C16H8BrN3O
Mol. Mass.:
338.158
SMILES:
On1c(c(Br)c2cc(C#N)c(cc12)C#N)-c1ccccc1
: