Target
Amine oxidase [flavin-containing] B
Ligand
BDBM50063519
Substrate
Meas. Tech.
ChEMBL_1463344 (CHEMBL3399617)
IC50
>100000±n/a nM
Citation
 Chirkova, ZVKabanova, MVFilimonov, SIAbramov, IGPetzer, APetzer, JPFirgang, SISuponitsky, KY Inhibition of monoamine oxidase by indole-5,6-dicarbonitrile derivatives. Bioorg Med Chem Lett 25:1206-11 (2015)  
Target
Name:
Amine oxidase [flavin-containing] B
Synonyms:
AOFB_HUMAN MAOB Monoamine oxidase type B (MAO B) Monoamine oxidase type B (MAOB)
Type:
Protein
Mol. Mass.:
58768.76
Organism:
Homo sapiens (Human)
Description:
P27338
Residue:
520
  
Inhibitor
Name:
BDBM50063519
Synonyms:
CHEMBL3398522
Type:
Small organic molecule
Emp. Form.:
C18H12ClN3O
Mol. Mass.:
321.76
SMILES:
COc1ccc(cc1)-c1c(Cl)c2cc(C#N)c(cc2n1C)C#N
: