Target
Amine oxidase [flavin-containing] A
Ligand
BDBM50110725
Substrate
Meas. Tech.
ChEMBL_1463343 (CHEMBL3399616)
IC50
3920±n/a nM
Citation
 Chirkova, ZVKabanova, MVFilimonov, SIAbramov, IGPetzer, APetzer, JPFirgang, SISuponitsky, KY Inhibition of monoamine oxidase by indole-5,6-dicarbonitrile derivatives. Bioorg Med Chem Lett 25:1206-11 (2015)  
Target
Name:
Amine oxidase [flavin-containing] A
Synonyms:
AOFA_HUMAN MAO-A Monoamine oxidase Monoamine oxidase type A (MAO A) Monoamine oxidase type A (MAOA)
Type:
Protein
Mol. Mass.:
59689.53
Organism:
Homo sapiens (Human)
Description:
P21397
Residue:
527
  
Inhibitor
Name:
BDBM50110725
Synonyms:
5-(hydroxymethyl)-3-(3-methylphenyl)-oxazolidin-2-one CHEMBL18116 Taloxotone
Type:
Small organic molecule
Emp. Form.:
C11H13NO3
Mol. Mass.:
207.2258
SMILES:
Cc1cccc(c1)N1CC(CO)OC1=O
: