Target
Amine oxidase [flavin-containing] A
Ligand
BDBM50063516
Substrate
Meas. Tech.
ChEMBL_1463343 (CHEMBL3399616)
IC50
3480±n/a nM
Citation
 Chirkova, ZVKabanova, MVFilimonov, SIAbramov, IGPetzer, APetzer, JPFirgang, SISuponitsky, KY Inhibition of monoamine oxidase by indole-5,6-dicarbonitrile derivatives. Bioorg Med Chem Lett 25:1206-11 (2015)  
Target
Name:
Amine oxidase [flavin-containing] A
Synonyms:
AOFA_HUMAN MAO-A Monoamine oxidase Monoamine oxidase type A (MAO A) Monoamine oxidase type A (MAOA)
Type:
Protein
Mol. Mass.:
59689.53
Organism:
Homo sapiens (Human)
Description:
P21397
Residue:
527
  
Inhibitor
Name:
BDBM50063516
Synonyms:
CHEMBL3398525
Type:
Small organic molecule
Emp. Form.:
C16H8BrN3O
Mol. Mass.:
338.158
SMILES:
On1c(c(Br)c2cc(C#N)c(cc12)C#N)-c1ccccc1
: