Target
Amine oxidase [flavin-containing] A
Ligand
BDBM50063518
Substrate
Meas. Tech.
ChEMBL_1463343 (CHEMBL3399616)
IC50
19400±n/a nM
Citation
 Chirkova, ZVKabanova, MVFilimonov, SIAbramov, IGPetzer, APetzer, JPFirgang, SISuponitsky, KY Inhibition of monoamine oxidase by indole-5,6-dicarbonitrile derivatives. Bioorg Med Chem Lett 25:1206-11 (2015)  
Target
Name:
Amine oxidase [flavin-containing] A
Synonyms:
AOFA_HUMAN MAO-A Monoamine oxidase Monoamine oxidase type A (MAO A) Monoamine oxidase type A (MAOA)
Type:
Protein
Mol. Mass.:
59689.53
Organism:
Homo sapiens (Human)
Description:
P21397
Residue:
527
  
Inhibitor
Name:
BDBM50063518
Synonyms:
CHEMBL3398523
Type:
Small organic molecule
Emp. Form.:
C18H12ClN3
Mol. Mass.:
305.761
SMILES:
Cc1ccc(cc1)-c1c(Cl)c2cc(C#N)c(cc2n1C)C#N
: