Target
Amine oxidase [flavin-containing] A
Ligand
BDBM50063522
Substrate
Meas. Tech.
ChEMBL_1463343 (CHEMBL3399616)
IC50
14±n/a nM
Citation
 Chirkova, ZVKabanova, MVFilimonov, SIAbramov, IGPetzer, APetzer, JPFirgang, SISuponitsky, KY Inhibition of monoamine oxidase by indole-5,6-dicarbonitrile derivatives. Bioorg Med Chem Lett 25:1206-11 (2015)  
Target
Name:
Amine oxidase [flavin-containing] A
Synonyms:
AOFA_HUMAN MAO-A Monoamine oxidase Monoamine oxidase type A (MAO A) Monoamine oxidase type A (MAOA)
Type:
Protein
Mol. Mass.:
59689.53
Organism:
Homo sapiens (Human)
Description:
P21397
Residue:
527
  
Inhibitor
Name:
BDBM50063522
Synonyms:
CHEMBL3398531
Type:
Small organic molecule
Emp. Form.:
C17H10ClN3
Mol. Mass.:
291.734
SMILES:
Cc1ccc(cc1)-c1[nH]c2cc(C#N)c(cc2c1Cl)C#N
: