Target
Amine oxidase [flavin-containing] B
Ligand
BDBM86779
Substrate
Meas. Tech.
ChEMBL_1463344 (CHEMBL3399617)
IC50
4.8±n/a nM
Citation
 Chirkova, ZVKabanova, MVFilimonov, SIAbramov, IGPetzer, APetzer, JPFirgang, SISuponitsky, KY Inhibition of monoamine oxidase by indole-5,6-dicarbonitrile derivatives. Bioorg Med Chem Lett 25:1206-11 (2015)  
Target
Name:
Amine oxidase [flavin-containing] B
Synonyms:
AOFB_HUMAN MAOB Monoamine oxidase type B (MAO B) Monoamine oxidase type B (MAOB)
Type:
Protein
Mol. Mass.:
58768.76
Organism:
Homo sapiens (Human)
Description:
P27338
Residue:
520
  
Inhibitor
Name:
BDBM86779
Synonyms:
Phthalonitrile analogue, 4h
Type:
Small organic molecule
Emp. Form.:
C15H9BrN2O
Mol. Mass.:
313.149
SMILES:
Brc1ccc(COc2ccc(C#N)c(c2)C#N)cc1
: