Target
Histone-lysine N-methyltransferase SUV39H1
Ligand
BDBM50063670
Substrate
Meas. Tech.
ChEMBL_1463678 (CHEMBL3399137)
IC50
9500±n/a nM
Citation
 Kung, PPHuang, BZehnder, LTatlock, JBingham, PKrivacic, CGajiwala, KDiehl, WYu, XMaegley, KA SAH derived potent and selective EZH2 inhibitors. Bioorg Med Chem Lett 25:1532-7 (2015)  
Target
Name:
Histone-lysine N-methyltransferase SUV39H1
Synonyms:
H3-K9-HMTase 1 KMT1A Position-effect variegation 3-9 homolog SUV39H1 Su(var)3-9 homolog 1 | Suppressor of variegation 3-9 homolog 1
Type:
PROTEIN
Mol. Mass.:
47917.07
Organism:
Homo sapiens (Human)
Description:
ChEMBL_1473655
Residue:
412
  
Inhibitor
Name:
BDBM50063670
Synonyms:
CHEMBL3397332
Type:
Small organic molecule
Emp. Form.:
C24H29N9O4S
Mol. Mass.:
539.61
SMILES:
N[C@@H](CCSC[C@H]1O[C@H]([C@H](O)[C@@H]1O)n1cnc2c(N)ncnc12)C(=O)NCc1cc([nH]n1)-c1ccccc1
: