Target
Cystathionine beta-synthase
Ligand
BDBM50064291
Substrate
Meas. Tech.
ChEMBL_1464805 (CHEMBL3404160)
IC50
187000±n/a nM
Citation
 Thorson, MKVan Wagoner, RMHarper, MKIreland, CMMajtan, TKraus, JPBarrios, AM Marine natural products as inhibitors of cystathionine beta-synthase activity. Bioorg Med Chem Lett 25:1064-6 (2015)  
Target
Name:
Cystathionine beta-synthase
Synonyms:
Beta-thionase CBS_HUMAN | Serine sulfhydrase
Type:
PROTEIN
Mol. Mass.:
60586.85
Organism:
Homo sapiens (Human)
Description:
ChEMBL_109567
Residue:
551
  
Inhibitor
Name:
BDBM50064291
Synonyms:
CHEMBL1957775
Type:
Small organic molecule
Emp. Form.:
C11H10N2O3S
Mol. Mass.:
250.274
SMILES:
COc1cc(\C=C2/NC(=S)NC2=O)ccc1O
: