Target
Adenosine receptor A2a
Ligand
BDBM50064622
Substrate
Meas. Tech.
ChEMBL_1465025 (CHEMBL3405041)
Ki
>100000±n/a nM
Citation
 Pandya, DHSharma, JAJalani, HBPandya, ANSudarsanam, VKachler, SKlotz, KNVasu, KK Novel thiazole-thiophene conjugates as adenosine receptor antagonists: synthesis, biological evaluation and docking studies. Bioorg Med Chem Lett 25:1306-9 (2015)  
Target
Name:
Adenosine receptor A2a
Synonyms:
A2A adenosine receptor (hA2A) ADENOSINE A2 ADORA2 Adenosine A2A receptor (A2AAR)
Type:
G Protein-Coupled Receptor (GPCR)
Mol. Mass.:
44716.46
Organism:
Homo sapiens (Human)
Description:
P29274
Residue:
412
  
Inhibitor
Name:
BDBM50064622
Synonyms:
CHEMBL3403730
Type:
Small organic molecule
Emp. Form.:
C19H24N4O5S2
Mol. Mass.:
452.548
SMILES:
CCOC(=O)c1c(NC(=O)c2sc(NOC(C)=O)nc2N(C)C)sc2CCCCc12
: