Target
C-X-C chemokine receptor type 2
Ligand
BDBM50065324
Substrate
Meas. Tech.
ChEMBL_1465563 (CHEMBL3404716)
IC50
5.0±n/a nM
Citation
 Austin, RPBennion, CBonnert, RVCheema, LCook, ARCox, RJEbden, MRGaw, AGrime, KMeghani, PNicholls, DPhillips, CSmith, NSteele, JStonehouse, JP Discovery and evaluation of a novel monocyclic series of CXCR2 antagonists. Bioorg Med Chem Lett 25:1616-20 (2015)  
Target
Name:
C-X-C chemokine receptor type 2
Synonyms:
C-X-C chemokine receptor type 2 (CXCR-2) CD_antigen=CD182 CXCR-2 CXCR2_HUMAN GRO/MGSA receptor IL-8 receptor type 2 IL8RB | Interleukin-8 receptor B
Type:
Protein
Mol. Mass.:
40767.88
Organism:
Homo sapiens (Human)
Description:
P25025
Residue:
360
  
Inhibitor
Name:
BDBM50065324
Synonyms:
CHEMBL3403848
Type:
Small organic molecule
Emp. Form.:
C16H21ClFN5O3S2
Mol. Mass.:
449.951
SMILES:
C[C@H](CO)Nc1cc(NS(=O)(=O)N(C)C)nc(SCc2cccc(Cl)c2F)n1
: