Target
Cannabinoid receptor 1
Ligand
BDBM50066800
Substrate
Meas. Tech.
ChEMBL_1465984 (CHEMBL3406966)
IC50
3150±n/a nM
Citation
 Nguyen, TGerman, NDecker, AMLi, JXWiley, JLThomas, BFKenakin, TPZhang, Y Structure-activity relationships of substituted 1H-indole-2-carboxamides as CB1 receptor allosteric modulators. Bioorg Med Chem 23:2195-203 (2015)  
Target
Name:
Cannabinoid receptor 1
Synonyms:
CANN6 CB-R CNR CNR1_HUMAN Cannabinoid receptor Cannabinoid receptor 1 (brain)
Type:
G Protein-Coupled Receptor (GPCR)
Mol. Mass.:
52868.96
Organism:
Homo sapiens (Human)
Description:
P21554
Residue:
472
  
Inhibitor
Name:
BDBM50066800
Synonyms:
CHEMBL3400540
Type:
Small organic molecule
Emp. Form.:
C19H19ClN2O
Mol. Mass.:
326.82
SMILES:
CCc1c([nH]c2ccc(Cl)cc12)C(=O)NCCc1ccccc1
: