Target
Cannabinoid receptor 1
Ligand
BDBM50389935
Substrate
Meas. Tech.
ChEMBL_1465984 (CHEMBL3406966)
IC50
212±n/a nM
Citation
 Nguyen, TGerman, NDecker, AMLi, JXWiley, JLThomas, BFKenakin, TPZhang, Y Structure-activity relationships of substituted 1H-indole-2-carboxamides as CB1 receptor allosteric modulators. Bioorg Med Chem 23:2195-203 (2015)  
Target
Name:
Cannabinoid receptor 1
Synonyms:
CANN6 CB-R CNR CNR1_HUMAN Cannabinoid receptor Cannabinoid receptor 1 (brain)
Type:
G Protein-Coupled Receptor (GPCR)
Mol. Mass.:
52868.96
Organism:
Homo sapiens (Human)
Description:
P21554
Residue:
472
  
Inhibitor
Name:
BDBM50389935
Synonyms:
CHEMBL2071071
Type:
Small organic molecule
Emp. Form.:
C22H24ClN3O
Mol. Mass.:
381.898
SMILES:
Clc1ccc2[nH]c(cc2c1)C(=O)NCCc1ccc(cc1)N1CCCCC1
: