Target
Tyrosine-protein kinase JAK2
Ligand
BDBM50067514
Substrate
Meas. Tech.
ChEMBL_1465688 (CHEMBL3405275)
Ki
270±n/a nM
Citation
 Boyd, MJBandarage, UKBennett, HByrn, RRDavies, IGu, WJacobs, MLedeboer, MWLedford, BLeeman, JRPerola, EWang, TBennani, YClark, MPCharifson, PS Isosteric replacements of the carboxylic acid of drug candidate VX-787: Effect of charge on antiviral potency and kinase activity of azaindole-based influenza PB2 inhibitors. Bioorg Med Chem Lett 25:1990-4 (2015)  
Target
Name:
Tyrosine-protein kinase JAK2
Synonyms:
JAK-2 JAK2_HUMAN Janus kinase 2 (JAK2) | Janus kinase 2 (a protein tyrosine kinase)
Type:
Protein
Mol. Mass.:
130684.68
Organism:
Homo sapiens (Human)
Description:
O60674
Residue:
1132
  
Inhibitor
Name:
BDBM50067514
Synonyms:
CHEMBL3401978
Type:
Small organic molecule
Emp. Form.:
C22H21F2N7O3
Mol. Mass.:
469.444
SMILES:
Fc1cnc2[nH]cc(-c3ncc(F)c(N[C@H]4C5CCC(CC5)[C@@H]4Cn4oc(=O)[nH]c4=O)n3)c2c1
: