Target
5-hydroxytryptamine receptor 6
Ligand
BDBM50068240
Substrate
Meas. Tech.
ChEMBL_1464328 (CHEMBL3404595)
Ki
6401±n/a nM
Citation
 Smusz, SKurczab, RSatala, GBojarski, AJ Fingerprint-based consensus virtual screening towards structurally new 5-HT(6)R ligands. Bioorg Med Chem Lett 25:1827-30 (2015)  
Target
Name:
5-hydroxytryptamine receptor 6
Synonyms:
5-HT-6 5-hydroxytryptamine receptor 6 (5-HT-6) 5-hydroxytryptamine receptor 6 (5HT6) HTR6 Serotonin 6 (5-HT6) receptor | Serotonin Receptor 6
Type:
G Protein-Coupled Receptor (GPCR)
Mol. Mass.:
46968.43
Organism:
Homo sapiens (Human)
Description:
P50406
Residue:
440
  
Inhibitor
Name:
BDBM50068240
Synonyms:
CHEMBL3403334
Type:
Small organic molecule
Emp. Form.:
C25H18N2O2S2
Mol. Mass.:
442.553
SMILES:
Nc1c(sc2nc(cc(-c3ccccc3)c12)-c1ccccc1)S(=O)(=O)c1ccccc1
: