Target
5-hydroxytryptamine receptor 1A
Ligand
BDBM50068245
Substrate
Meas. Tech.
ChEMBL_1464329 (CHEMBL3404596)
Ki
2745±n/a nM
Citation
 Smusz, SKurczab, RSatala, GBojarski, AJ Fingerprint-based consensus virtual screening towards structurally new 5-HT(6)R ligands. Bioorg Med Chem Lett 25:1827-30 (2015)  
Target
Name:
5-hydroxytryptamine receptor 1A
Synonyms:
5-HT-1A 5-hydroxytryptamine receptor 1A (5-HT-1A) ADRB2RL1 Dopamine D2 receptor and serotonin 1a receptor HTR1A | Serotonin receptor 1A
Type:
Mol. Mass.:
46122.49
Organism:
Homo sapiens (Human)
Description:
Residue:
422
  
Inhibitor
Name:
BDBM50068245
Synonyms:
CHEMBL1323386
Type:
Small organic molecule
Emp. Form.:
C19H13ClFNO2S
Mol. Mass.:
373.828
SMILES:
Fc1cc(Cl)ccc1CN1c2ccccc2S(=O)(=O)c2ccccc12
: