Target
5-hydroxytryptamine receptor 1A
Ligand
BDBM50068247
Substrate
Meas. Tech.
ChEMBL_1464329 (CHEMBL3404596)
Ki
12490±n/a nM
Citation
 Smusz, SKurczab, RSatala, GBojarski, AJ Fingerprint-based consensus virtual screening towards structurally new 5-HT(6)R ligands. Bioorg Med Chem Lett 25:1827-30 (2015)  
Target
Name:
5-hydroxytryptamine receptor 1A
Synonyms:
5-HT-1A 5-hydroxytryptamine receptor 1A (5-HT-1A) ADRB2RL1 Dopamine D2 receptor and serotonin 1a receptor HTR1A | Serotonin receptor 1A
Type:
Mol. Mass.:
46122.49
Organism:
Homo sapiens (Human)
Description:
Residue:
422
  
Inhibitor
Name:
BDBM50068247
Synonyms:
CHEMBL3403340
Type:
Small organic molecule
Emp. Form.:
C24H19ClN2O3
Mol. Mass.:
418.872
SMILES:
COc1cccc(c1)-n1cc(C(=O)N(C)c2cccc(Cl)c2)c2ccccc2c1=O
: