Target
5-hydroxytryptamine receptor 2A
Ligand
BDBM50068240
Substrate
Meas. Tech.
ChEMBL_1464330 (CHEMBL3404597)
Ki
6836±n/a nM
Citation
 Smusz, SKurczab, RSatala, GBojarski, AJ Fingerprint-based consensus virtual screening towards structurally new 5-HT(6)R ligands. Bioorg Med Chem Lett 25:1827-30 (2015)  
Target
Name:
5-hydroxytryptamine receptor 2A
Synonyms:
5-HT-2 5-HT2A 5-hydroxytryptamine receptor 2A (5HT-2A) 5HT2A_HUMAN HTR2A | Serotonin receptor 2A
Type:
undefined
Mol. Mass.:
52607.65
Organism:
Homo sapiens (Human)
Description:
P28223
Residue:
471
  
Inhibitor
Name:
BDBM50068240
Synonyms:
CHEMBL3403334
Type:
Small organic molecule
Emp. Form.:
C25H18N2O2S2
Mol. Mass.:
442.553
SMILES:
Nc1c(sc2nc(cc(-c3ccccc3)c12)-c1ccccc1)S(=O)(=O)c1ccccc1
: